Reaction Details
TargetSerine/threonine-protein kinase Chk1
LigandBDBM50374066
Substrate/Competitorn/a
Meas. Tech.ChEMBL_468880 (CHEMBL949043)
IC50 134±n/a nM
Citation Smaill, JBLee, HHPalmer, BDThompson, AMSquire, CJBaker, ENBooth, RJKraker, AHook, KDenny, WA Synthesis and structure-activity relationships of soluble 8-substituted 4-(2-chlorophenyl)-9-hydroxypyrrolo[3,4-c]carbazole-1,3(2H,6H)-diones as inhibitors of the Wee1 and Chk1 checkpoint kinases. Bioorg Med Chem Lett18:929-33 (2008) 
 
Serine/threonine-protein kinase Chk1
Name:Serine/threonine-protein kinase Chk1
Type:Enzyme Catalytic Domain
Mol. Mass.:54443.02
Organism:Homo sapiens (Human)
Description:gi_166295192
Residue:476
BDBM50374066
NameBDBM50374066
Synonyms:CHEMBL401776
TypeSmall organic molecule
Emp. Form.C27H26ClN3O5
Mol. Mass.507.965
SMILESCN(C)CCCOc1cc2n(CCO)c3cc(c4C(=O)NC(=O)c4c3c2cc1O)-c1ccccc1Cl