Reaction Details
TargetCyclin-dependent kinase 1
LigandBDBM50232227
Substrate/Competitorn/a
Meas. Tech.ChEMBL_468883 (CHEMBL949046)
IC50 250±n/a nM
Citation Smaill, JBLee, HHPalmer, BDThompson, AMSquire, CJBaker, ENBooth, RJKraker, AHook, KDenny, WA Synthesis and structure-activity relationships of soluble 8-substituted 4-(2-chlorophenyl)-9-hydroxypyrrolo[3,4-c]carbazole-1,3(2H,6H)-diones as inhibitors of the Wee1 and Chk1 checkpoint kinases. Bioorg Med Chem Lett18:929-33 (2008) 
 
Cyclin-dependent kinase 1
Name:Cyclin-dependent kinase 1
Type:Enzyme Subunit
Mol. Mass.:34101.08
Organism:Homo sapiens (Human)
Description:P06493
Residue:297
BDBM50232227
NameBDBM50232227
Synonyms:4-(2-chlorophenyl)-9-hydroxy-6-(2-hydroxyethyl)-8-(3-morpholinopropoxy)pyrrolo[3,4-c]carbazole-1,3(2H,6H)-dione | CHEMBL271715
TypeSmall organic molecule
Emp. Form.C29H28ClN3O6
Mol. Mass.550.002
SMILESOCCn1c2cc(OCCCN3CCOCC3)c(O)cc2c2c3C(=O)NC(=O)c3c(cc12)-c1ccccc1Cl