Reaction Details
TargetHistamine H3 receptor
LigandBDBM50374100
Substrate/Competitorn/a
Meas. Tech.ChEMBL_468943 (CHEMBL930591)
Ki 0.05±n/a nM
Citation Santora, VJCovel, JAHayashi, RHofilena, BJIbarra, JBPulley, MDWeinhouse, MISengupta, DDuffield, JJSemple, GWebb, RRSage, CRen, APereira, GKnudsen, JEdwards, JESuarez, MFrazer, JThomsen, WHauser, EWhelan, KGrottick, AJ A new family of H3 receptor antagonists based on the natural product Conessine. Bioorg Med Chem Lett18:1490-4 (2008) 
 
Histamine H3 receptor
Name:Histamine H3 receptor
Type:G Protein-Coupled Receptor (GPCR)
Mol. Mass.:48607.98
Organism:Rattus norvegicus (rat)
Description:n/a
Residue:445
BDBM50374100
NameBDBM50374100
Synonyms:CHEMBL270011
TypeSmall organic molecule
Emp. Form.C26H32N2
Mol. Mass.372.5457
SMILESC(Cc1ccc(cc1)C1=CC[C@H]2CN(Cc3ccccc3)C[C@@H]12)N1CCCC1