Reaction Details
TargetEpidermal growth factor receptor
LigandBDBM3533
Substrate/Competitorn/a
Meas. Tech.ChEMBL_468986 (CHEMBL952131)
IC50 0.891251±n/a nM
Citation Kolb, PHuang, DDey, FCaflisch, A Discovery of kinase inhibitors by high-throughput docking and scoring based on a transferable linear interaction energy model. J Med Chem51:1179-88 (2008) 
 
Epidermal growth factor receptor
Name:Epidermal growth factor receptor
Type:Receptor Kinase Domain
Mol. Mass.:134279.59
Organism:Homo sapiens (Human)
Description:P00533
Residue:1210
BDBM3533
NameBDBM3533
Synonyms:CHEMBL1204305 N-(3-iodophenyl)-6,7-dimethoxyquinazolin-4-amine | PD153035 Analog 33
TypeSmall organic molecule
Emp. Form.C16H14IN3O2
Mol. Mass.407.2057
SMILESCOc1cc2ncnc(Nc3cccc(I)c3)c2cc1OC