Reaction Details
TargetEpidermal growth factor receptor
LigandBDBM50027266
Substrate/Competitorn/a
Meas. Tech.ChEMBL_468986 (CHEMBL952131)
IC50 0.245471±n/a nM
Citation Kolb, PHuang, DDey, FCaflisch, A Discovery of kinase inhibitors by high-throughput docking and scoring based on a transferable linear interaction energy model. J Med Chem51:1179-88 (2008) 
 
Epidermal growth factor receptor
Name:Epidermal growth factor receptor
Type:Receptor Kinase Domain
Mol. Mass.:134279.59
Organism:Homo sapiens (Human)
Description:P00533
Residue:1210
BDBM50027266
NameBDBM50027266
Synonyms:CHEMBL270696
TypeSmall organic molecule
Emp. Form.C15H14BrN5O
Mol. Mass.360.209
SMILESOCCNc1c(Br)cccc1Nc1ncnc2ccncc12