Reaction Details
TargetEpidermal growth factor receptor
LigandBDBM3683
Substrate/Competitorn/a
Meas. Tech.ChEMBL_468986 (CHEMBL952131)
IC50 1.5±n/a nM
Citation Kolb, PHuang, DDey, FCaflisch, A Discovery of kinase inhibitors by high-throughput docking and scoring based on a transferable linear interaction energy model. J Med Chem51:1179-88 (2008) 
 
Epidermal growth factor receptor
Name:Epidermal growth factor receptor
Type:Receptor Kinase Domain
Mol. Mass.:134279.59
Organism:Homo sapiens (Human)
Description:P00533
Residue:1210
BDBM3683
NameBDBM3683
Synonyms:4-anilinopyrimido[5,4-d]pyrimidine deriv. 5b 8-N-(3-bromophenyl)-[1,3]diazino[5,4-d]pyrimidine-2,8-diamine
TypeSmall organic molecule
Emp. Form.C12H9BrN6
Mol. Mass.317.144
SMILESNc1ncc2ncnc(Nc3cccc(Br)c3)c2n1