Reaction Details
TargetEpidermal growth factor receptor
LigandBDBM3685
Substrate/Competitorn/a
Meas. Tech.ChEMBL_468986 (CHEMBL952131)
IC50 0.954993±n/a nM
Citation Kolb, PHuang, DDey, FCaflisch, A Discovery of kinase inhibitors by high-throughput docking and scoring based on a transferable linear interaction energy model. J Med Chem51:1179-88 (2008) 
 
Epidermal growth factor receptor
Name:Epidermal growth factor receptor
Type:Receptor Kinase Domain
Mol. Mass.:134279.59
Organism:Homo sapiens (Human)
Description:P00533
Residue:1210
BDBM3685
NameBDBM3685
Synonyms:4-[(3-Bromophenyl)amino]-6-(dimethylamino)pyrimido-[5,4-d]pyrimidine 8-N-(3-bromophenyl)-2-N,2-N-dimethyl-[1,3]diazino[5,4-d]pyrimidine-2,8-diamine
TypeSmall organic molecule
Emp. Form.C14H13BrN6
Mol. Mass.345.197
SMILESCN(C)c1ncc2ncnc(Nc3cccc(Br)c3)c2n1