Reaction Details
TargetEpidermal growth factor receptor
LigandBDBM50027273
Substrate/Competitorn/a
Meas. Tech.ChEMBL_468986 (CHEMBL952131)
IC50 0.512861±n/a nM
Citation Kolb, PHuang, DDey, FCaflisch, A Discovery of kinase inhibitors by high-throughput docking and scoring based on a transferable linear interaction energy model. J Med Chem51:1179-88 (2008) 
 
Epidermal growth factor receptor
Name:Epidermal growth factor receptor
Type:Receptor Kinase Domain
Mol. Mass.:134279.59
Organism:Homo sapiens (Human)
Description:P00533
Residue:1210
BDBM50027273
NameBDBM50027273
Synonyms:CHEMBL272865
TypeSmall organic molecule
Emp. Form.C19H18BrN7
Mol. Mass.424.297
SMILESBrc1cccc(Nc2ncnc3ccncc23)c1NCCCn1ccnc1