Reaction Details
TargetEpidermal growth factor receptor
LigandBDBM50027338
Substrate/Competitorn/a
Meas. Tech.ChEMBL_468986 (CHEMBL952131)
IC50 0.251189±n/a nM
Citation Kolb, PHuang, DDey, FCaflisch, A Discovery of kinase inhibitors by high-throughput docking and scoring based on a transferable linear interaction energy model. J Med Chem51:1179-88 (2008) 
 
Epidermal growth factor receptor
Name:Epidermal growth factor receptor
Type:Receptor Kinase Domain
Mol. Mass.:134279.59
Organism:Homo sapiens (Human)
Description:P00533
Residue:1210
BDBM50027338
NameBDBM50027338
Synonyms:CHEMBL53426
TypeSmall organic molecule
Emp. Form.C17H15BrN8
Mol. Mass.411.259
SMILESBrc1cccc(Nc2ncnc3cnc(NCCc4c[nH]cn4)nc23)c1