Reaction Details
TargetEpidermal growth factor receptor
LigandBDBM3557
Substrate/Competitorn/a
Meas. Tech.ChEMBL_468986 (CHEMBL952131)
IC50 0.173780±n/a nM
Citation Kolb, PHuang, DDey, FCaflisch, A Discovery of kinase inhibitors by high-throughput docking and scoring based on a transferable linear interaction energy model. J Med Chem51:1179-88 (2008) 
 
Epidermal growth factor receptor
Name:Epidermal growth factor receptor
Type:Receptor Kinase Domain
Mol. Mass.:134279.59
Organism:Homo sapiens (Human)
Description:P00533
Residue:1210
BDBM3557
NameBDBM3557
Synonyms:CHEMBL418967 PD153035 Analog 57
TypeSmall organic molecule
Emp. Form.C20H22BrN3O2
Mol. Mass.416.312
SMILESCCCOc1cc2ncnc(Nc3cccc(Br)c3)c2cc1OCCC