Reaction Details
TargetCyclin-dependent kinase 2
LigandBDBM7692
Substrate/Competitorn/a
Meas. Tech.ChEMBL_468964 (CHEMBL952109)
IC50 1.2±n/a nM
Citation Kolb, PHuang, DDey, FCaflisch, A Discovery of kinase inhibitors by high-throughput docking and scoring based on a transferable linear interaction energy model. J Med Chem51:1179-88 (2008) 
 
Cyclin-dependent kinase 2
Name:Cyclin-dependent kinase 2
Type:Enzyme Subunit
Mol. Mass.:33938.17
Organism:Homo sapiens (Human)
Description:P24941
Residue:298
BDBM7692
NameBDBM7692
Synonyms:4-[N -(4-Isobutyl-2-oxo-1,2-dihydro-indol-3-ylidene)hydrazino]benzenesulfonamide Oxindole-Based Inhibitor 28
TypeSmall organic molecule
Emp. Form.C18H20N4O3S
Mol. Mass.372.441
SMILESCC(C)Cc1cccc2NC(=O)C(=NNc3ccc(cc3)S(N)(=O)=O)c12