Reaction Details
TargetCyclin-dependent kinase 2
LigandBDBM7688
Substrate/Competitorn/a
Meas. Tech.ChEMBL_468964 (CHEMBL952109)
IC50 2±n/a nM
Citation Kolb, PHuang, DDey, FCaflisch, A Discovery of kinase inhibitors by high-throughput docking and scoring based on a transferable linear interaction energy model. J Med Chem51:1179-88 (2008) 
 
Cyclin-dependent kinase 2
Name:Cyclin-dependent kinase 2
Type:Enzyme Subunit
Mol. Mass.:33938.17
Organism:Homo sapiens (Human)
Description:P24941
Residue:298
BDBM7688
NameBDBM7688
Synonyms:4-({1-[(3Z)-5-(1,3-oxazol-5-yl)-2-oxo-2,3-dihydro-1H-indol-3-ylidene]ethyl}amino)benzene-1-sulfonamide Oxindole-Based Inhibitor 24
TypeSmall organic molecule
Emp. Form.C19H16N4O4S
Mol. Mass.396.42
SMILESCC(=Nc1ccc(cc1)S(N)(=O)=O)C1C(=O)Nc2ccc(cc12)-c1cnco1