Reaction Details
TargetCyclin-dependent kinase 2
LigandBDBM7746
Substrate/Competitorn/a
Meas. Tech.ChEMBL_468964 (CHEMBL952109)
IC50 1.5±n/a nM
Citation Kolb, PHuang, DDey, FCaflisch, A Discovery of kinase inhibitors by high-throughput docking and scoring based on a transferable linear interaction energy model. J Med Chem51:1179-88 (2008) 
 
Cyclin-dependent kinase 2
Name:Cyclin-dependent kinase 2
Type:Enzyme Subunit
Mol. Mass.:33938.17
Organism:Homo sapiens (Human)
Description:P24941
Residue:298
BDBM7746
NameBDBM7746
Synonyms:4-({[(3Z)-4-oxo-5,10-diazatricyclo[7.4.0.0^{2,6}]trideca-1,6,8,10,12-pentaen-3-ylidene]methyl}amino)benzene-1-sulfonamide Oxindole-Based Inhibitor 82
TypeSmall organic molecule
Emp. Form.C18H14N4O3S
Mol. Mass.366.394
SMILESNS(=O)(=O)c1ccc(cc1)N=Cc1c2c(ccc3[nH]cccc23)[nH]c1=O