Reaction Details
TargetCyclin-dependent kinase 2
LigandBDBM7719
Substrate/Competitorn/a
Meas. Tech.ChEMBL_468964 (CHEMBL952109)
IC50 1.9±n/a nM
Citation Kolb, PHuang, DDey, FCaflisch, A Discovery of kinase inhibitors by high-throughput docking and scoring based on a transferable linear interaction energy model. J Med Chem51:1179-88 (2008) 
 
Cyclin-dependent kinase 2
Name:Cyclin-dependent kinase 2
Type:Enzyme Subunit
Mol. Mass.:33938.17
Organism:Homo sapiens (Human)
Description:P24941
Residue:298
BDBM7719
NameBDBM7719
Synonyms:4-({[(3Z)-5-(3-methylbutanoyl)-2-oxo-2,3-dihydro-1H-indol-3-ylidene]methyl}amino)benzene-1-sulfonamide Oxindole-Based Inhibitor 55
TypeSmall organic molecule
Emp. Form.C20H21N3O4S
Mol. Mass.399.463
SMILESCC(C)CC(=O)c1ccc2NC(=O)C(C=Nc3ccc(cc3)S(N)(=O)=O)c2c1