Reaction Details
TargetCyclin-dependent kinase 2
LigandBDBM7725
Substrate/Competitorn/a
Meas. Tech.ChEMBL_468964 (CHEMBL952109)
IC50 2.1±n/a nM
Citation Kolb, PHuang, DDey, FCaflisch, A Discovery of kinase inhibitors by high-throughput docking and scoring based on a transferable linear interaction energy model. J Med Chem51:1179-88 (2008) 
 
Cyclin-dependent kinase 2
Name:Cyclin-dependent kinase 2
Type:Enzyme Subunit
Mol. Mass.:33938.17
Organism:Homo sapiens (Human)
Description:P24941
Residue:298
BDBM7725
NameBDBM7725
Synonyms:(3Z)-2-oxo-N-(pyridin-3-ylmethyl)-3-[2-(4-sulfamoylphenyl)hydrazin-1-ylidene]-2,3-dihydro-1H-indole-5-carboxamide Oxindole-Based Inhibitor 61
TypeSmall organic molecule
Emp. Form.C21H18N6O4S
Mol. Mass.450.47
SMILESNS(=O)(=O)c1ccc(NN=C2C(=O)Nc3ccc(cc23)C(=O)NCc2cccnc2)cc1