Reaction Details
TargetMitogen-activated protein kinase 14
LigandBDBM50122386
Substrate/Competitorn/a
Meas. Tech.ChEMBL_468977 (CHEMBL952122)
IC50 0.100000±n/a nM
Citation Kolb, PHuang, DDey, FCaflisch, A Discovery of kinase inhibitors by high-throughput docking and scoring based on a transferable linear interaction energy model. J Med Chem51:1179-88 (2008) 
 
Mitogen-activated protein kinase 14
Name:Mitogen-activated protein kinase 14
Type:Serine/threonine-protein kinase
Mol. Mass.:41286.76
Organism:Homo sapiens (Human)
Description:Q16539
Residue:360
BDBM50122386
NameBDBM50122386
Synonyms:5-(2-Chloro-4-fluoro-phenyl)-1-(2,6-dichloro-phenyl)-7-piperidin-4-yl-3,4-dihydro-1H-quinazolin-2-one CHEMBL328614
TypeSmall organic molecule
Emp. Form.C25H21Cl3FN3O
Mol. Mass.504.811
SMILESFc1ccc(c(Cl)c1)-c1cc(cc2N(C(=O)NCc12)c1c(Cl)cccc1Cl)C1CCNCC1