Reaction Details
TargetPituitary adenylate cyclase-activating polypeptide type I receptor
LigandBDBM50110055
Substrate/Competitorn/a
Meas. Tech.ChEMBL_469030 (CHEMBL949341)
Ki 604±n/a nM
Citation Beebe, XDarczak, DDavis-Taber, RAUchic, MEScott, VEJarvis, MFStewart, AO Discovery and SAR of hydrazide antagonists of the pituitary adenylate cyclase-activating polypeptide (PACAP) receptor type 1 (PAC1-R). Bioorg Med Chem Lett18:2162-6 (2008) 
 
Pituitary adenylate cyclase-activating polypeptide type I receptor
Name:Pituitary adenylate cyclase-activating polypeptide type I receptor
Type:PROTEIN
Mol. Mass.:53307.50
Organism:Homo sapiens (Human)
Description:ChEMBL_498617
Residue:468
BDBM50110055
NameBDBM50110055
Synonyms:3-Chloro-4-hydroxy-benzoic acid [1-(4-isopropyl-benzyl)-1H-indol-4-ylmethylene]-hydrazide CHEMBL153038 | N'-((1-(4-isopropylbenzyl)-1H-indol-4-yl)methylene)-3-chloro-4-hydroxybenzohydrazide
TypeSmall organic molecule
Emp. Form.C26H24ClN3O2
Mol. Mass.445.941
SMILESCC(C)c1ccc(Cn2ccc3c(\C=N\NC(=O)c4ccc(O)c(Cl)c4)cccc23)cc1