Reaction Details
TargetPituitary adenylate cyclase-activating polypeptide type I receptor
LigandBDBM50374179
Substrate/Competitorn/a
Meas. Tech.ChEMBL_469030 (CHEMBL949341)
Ki 152±n/a nM
Citation Beebe, XDarczak, DDavis-Taber, RAUchic, MEScott, VEJarvis, MFStewart, AO Discovery and SAR of hydrazide antagonists of the pituitary adenylate cyclase-activating polypeptide (PACAP) receptor type 1 (PAC1-R). Bioorg Med Chem Lett18:2162-6 (2008) 
 
Pituitary adenylate cyclase-activating polypeptide type I receptor
Name:Pituitary adenylate cyclase-activating polypeptide type I receptor
Type:PROTEIN
Mol. Mass.:53307.50
Organism:Homo sapiens (Human)
Description:ChEMBL_498617
Residue:468
BDBM50374179
NameBDBM50374179
Synonyms:CHEMBL409325
TypeSmall organic molecule
Emp. Form.C26H27ClN2O5
Mol. Mass.482.956
SMILESCOc1cc(\C=N\NC(=O)c2ccc(O)c(Cl)c2)cc(OCc2ccc(cc2)C(C)C)c1OC