Reaction Details
TargetPituitary adenylate cyclase-activating polypeptide type I receptor
LigandBDBM50374182
Substrate/Competitorn/a
Meas. Tech.ChEMBL_469030 (CHEMBL949341)
Ki 522±n/a nM
Citation Beebe, XDarczak, DDavis-Taber, RAUchic, MEScott, VEJarvis, MFStewart, AO Discovery and SAR of hydrazide antagonists of the pituitary adenylate cyclase-activating polypeptide (PACAP) receptor type 1 (PAC1-R). Bioorg Med Chem Lett18:2162-6 (2008) 
 
Pituitary adenylate cyclase-activating polypeptide type I receptor
Name:Pituitary adenylate cyclase-activating polypeptide type I receptor
Type:PROTEIN
Mol. Mass.:53307.50
Organism:Homo sapiens (Human)
Description:ChEMBL_498617
Residue:468
BDBM50374182
NameBDBM50374182
Synonyms:CHEMBL272118
TypeSmall organic molecule
Emp. Form.C21H17ClN2O3
Mol. Mass.380.824
SMILESOc1ccc(cc1Cl)C(=O)N\N=C\c1ccc(OCc2ccccc2)cc1