Reaction Details
TargetBeta-secretase 1
LigandBDBM50374225
Substrate/Competitorn/a
Meas. Tech.ChEMBL_469154 (CHEMBL929073)
IC50 57±n/a nM
Citation Iserloh, UPan, JStamford, AWKennedy, MEZhang, QZhang, LParker, EMMcHugh, NAFavreau, LStrickland, CVoigt, J Discovery of an orally efficaceous 4-phenoxypyrrolidine-based BACE-1 inhibitor. Bioorg Med Chem Lett18:418-22 (2008) 
 
Beta-secretase 1
Name:Beta-secretase 1
Type:Protein
Mol. Mass.:55755.10
Organism:Homo sapiens (Human)
Description:P56817
Residue:501
BDBM50374225
NameBDBM50374225
Synonyms:CHEMBL403108
TypeSmall organic molecule
Emp. Form.C33H45F2N3O4
Mol. Mass.585.7249
SMILESCCCCN1C[C@H]([C@H](CC(C)C)C1=O)C(=O)N[C@@H](Cc1cc(F)cc(F)c1)[C@H](O)[C@H]1C[C@H](CN1)OCc1ccccc1