Reaction Details
TargetBeta-secretase 1
LigandBDBM50374253
Substrate/Competitorn/a
Meas. Tech.ChEMBL_469154 (CHEMBL929073)
IC50 0.700000±n/a nM
Citation Iserloh, UPan, JStamford, AWKennedy, MEZhang, QZhang, LParker, EMMcHugh, NAFavreau, LStrickland, CVoigt, J Discovery of an orally efficaceous 4-phenoxypyrrolidine-based BACE-1 inhibitor. Bioorg Med Chem Lett18:418-22 (2008) 
 
Beta-secretase 1
Name:Beta-secretase 1
Type:Protein
Mol. Mass.:55755.10
Organism:Homo sapiens (Human)
Description:P56817
Residue:501
BDBM50374253
NameBDBM50374253
Synonyms:CHEMBL403195
TypeSmall organic molecule
Emp. Form.C34H39F2N3O5
Mol. Mass.607.6874
SMILESCOC[C@H]1CCCN1C(=O)c1cc(C)cc(c1)C(=O)N[C@@H](Cc1cc(F)cc(F)c1)[C@H](O)[C@H]1C[C@H](CN1)Oc1ccccc1