Reaction Details
TargetCathepsin E
LigandBDBM50372181
Substrate/Competitorn/a
Meas. Tech.ChEMBL_469158 (CHEMBL929077)
Ki 24±n/a nM
Citation Iserloh, UPan, JStamford, AWKennedy, MEZhang, QZhang, LParker, EMMcHugh, NAFavreau, LStrickland, CVoigt, J Discovery of an orally efficaceous 4-phenoxypyrrolidine-based BACE-1 inhibitor. Bioorg Med Chem Lett18:418-22 (2008) 
 
Cathepsin E
Name:Cathepsin E
Type:Enzyme
Mol. Mass.:43298.99
Organism:Homo sapiens (Human)
Description:P14091
Residue:396
BDBM50372181
NameBDBM50372181
Synonyms:CHEMBL403727
TypeSmall organic molecule
Emp. Form.C34H41F2N3O4
Mol. Mass.593.7038
SMILESCCCN(CCC)C(=O)c1cc(C)cc(c1)C(=O)N[C@@H](Cc1cc(F)cc(F)c1)[C@H](O)[C@H]1C[C@H](CN1)Oc1ccccc1