Reaction Details
TargetCarbonic anhydrase 9
LigandBDBM29278
Substrate/Competitorn/a
Meas. Tech.ChEMBL_469184 (CHEMBL932209)
Ki 103±n/a nM
Citation Rami, MWinum, JYInnocenti, AMontero, JLScozzafava, ASupuran, CT Carbonic anhydrase inhibitors: copper(II) complexes of polyamino-polycarboxylamido aromatic/heterocyclic sulfonamides are very potent inhibitors of the tumor-associated isoforms IX and XII. Bioorg Med Chem Lett18:836-41 (2008) 
 
Carbonic anhydrase 9
Name:Carbonic anhydrase 9
Type:Enzyme
Mol. Mass.:49669.03
Organism:Homo sapiens (Human)
Description:Catalytic domain of human cloned isozyme was used in the assay
Residue:459
BDBM29278
NameBDBM29278
Synonyms:CHEMBL310671 SAC Saccharin
TypeSmall organic molecule
Emp. Form.C7H5NO3S
Mol. Mass.183.185
SMILESO=C1NS(=O)(=O)c2ccccc12