Reaction Details
TargetCarbonic anhydrase 1
LigandBDBM50097277
Substrate/Competitorn/a
Meas. Tech.ChEMBL_469182 (CHEMBL932207)
Ki 9.5±n/a nM
Citation Rami, MWinum, JYInnocenti, AMontero, JLScozzafava, ASupuran, CT Carbonic anhydrase inhibitors: copper(II) complexes of polyamino-polycarboxylamido aromatic/heterocyclic sulfonamides are very potent inhibitors of the tumor-associated isoforms IX and XII. Bioorg Med Chem Lett18:836-41 (2008) 
 
Carbonic anhydrase 1
Name:Carbonic anhydrase 1
Type:Enzyme
Mol. Mass.:28873.37
Organism:Homo sapiens (Human)
Description:P00915
Residue:261
BDBM50097277
NameBDBM50097277
Synonyms:((2-{Carboxymethyl-[2-(carboxymethyl-{[2-(4-sulfamoyl-phenyl)-ethylcarbamoyl]-methyl}-amino)-ethyl]-amino}-ethyl)-{[2-(4-sulfamoyl-phenyl)-ethylcarbamoyl]-methyl}-amino)-acetic acid CHEMBL1795062 Zinc; ((2-{Carboxymethyl-[2-(carboxymethyl-{[2-(4-sulfamoyl-phenyl)-ethylcarbamoyl]-methyl}-amino)-ethyl]-amino}-ethyl)-{[2-(4-sulfamoyl-phenyl)-ethylcarbamoyl]-methyl}-amino)-acetic acid
TypeSmall organic molecule
Emp. Form.C30H43N7O12S2
Mol. Mass.757.832
SMILESNS(=O)(=O)c1ccc(CCNC(=O)CN(CCN(CCN(CC(O)=O)CC(=O)NCCc2ccc(cc2)S(N)(=O)=O)CC(O)=O)CC(O)=O)cc1