Reaction Details
TargetCarbonic anhydrase 1
LigandBDBM50097308
Substrate/Competitorn/a
Meas. Tech.ChEMBL_469182 (CHEMBL932207)
Ki 578±n/a nM
Citation Rami, MWinum, JYInnocenti, AMontero, JLScozzafava, ASupuran, CT Carbonic anhydrase inhibitors: copper(II) complexes of polyamino-polycarboxylamido aromatic/heterocyclic sulfonamides are very potent inhibitors of the tumor-associated isoforms IX and XII. Bioorg Med Chem Lett18:836-41 (2008) 
 
Carbonic anhydrase 1
Name:Carbonic anhydrase 1
Type:Enzyme
Mol. Mass.:28873.37
Organism:Homo sapiens (Human)
Description:P00915
Residue:261
BDBM50097308
NameBDBM50097308
Synonyms:CHEMBL287145 | {{2-[carboxymethyl-(2-{carboxymethyl-[(3-sulfamoyl-phenylcarbamoyl)-methyl]-amino}-ethyl)-amino]-ethyl}-[(3-sulfamoyl-phenylcarbamoyl)-methyl]-amino}-acetic acid
TypeSmall organic molecule
Emp. Form.C26H35N7O12S2
Mol. Mass.701.726
SMILESNS(=O)(=O)c1cccc(NC(=O)CN(CCN(CCN(CC(O)=O)CC(=O)Nc2cccc(c2)S(N)(=O)=O)CC(O)=O)CC(O)=O)c1