Reaction Details
TargetCarbonic anhydrase 2
LigandBDBM50228326
Substrate/Competitorn/a
Meas. Tech.ChEMBL_469183 (CHEMBL932208)
Ki 0.89±n/a nM
Citation Rami, MWinum, JYInnocenti, AMontero, JLScozzafava, ASupuran, CT Carbonic anhydrase inhibitors: copper(II) complexes of polyamino-polycarboxylamido aromatic/heterocyclic sulfonamides are very potent inhibitors of the tumor-associated isoforms IX and XII. Bioorg Med Chem Lett18:836-41 (2008) 
 
Carbonic anhydrase 2
Name:Carbonic anhydrase 2
Type:Enzyme
Mol. Mass.:29250.71
Organism:Homo sapiens (Human)
Description:P00918
Residue:260
BDBM50228326
NameBDBM50228326
Synonyms:CHEMBL1795055 {(2-{Carboxymethyl-[(4-sulfamoyl-benzylcarbamoyl)-methyl]-amino}-ethyl)-[(4-sulfamoyl-benzylcarbamoyl)-methyl]-amino}-acetic acid | {(2-{Carboxymethyl-[(4-sulfamoyl-benzylcarbamoyl)-methyl]-amino}-ethyl)-[(4-sulfamoyl-benzylcarbamoyl)-methyl]-amino}-acetic acid; compound with Zn complex
TypeSmall organic molecule
Emp. Form.C24H32N6O10S2
Mol. Mass.628.675
SMILESNS(=O)(=O)c1ccc(CNC(=O)CN(CCN(CC(O)=O)CC(=O)NCc2ccc(cc2)S(N)(=O)=O)CC(O)=O)cc1