Reaction Details
TargetCarbonic anhydrase 9
LigandBDBM50097280
Substrate/Competitorn/a
Meas. Tech.ChEMBL_469184 (CHEMBL932209)
Ki 8.4±n/a nM
Citation Rami, MWinum, JYInnocenti, AMontero, JLScozzafava, ASupuran, CT Carbonic anhydrase inhibitors: copper(II) complexes of polyamino-polycarboxylamido aromatic/heterocyclic sulfonamides are very potent inhibitors of the tumor-associated isoforms IX and XII. Bioorg Med Chem Lett18:836-41 (2008) 
 
Carbonic anhydrase 9
Name:Carbonic anhydrase 9
Type:Enzyme
Mol. Mass.:49669.03
Organism:Homo sapiens (Human)
Description:Catalytic domain of human cloned isozyme was used in the assay
Residue:459
BDBM50097280
NameBDBM50097280
Synonyms:CHEMBL284694 Zinc; {{2-[Carboxymethyl-(2-{carboxymethyl-[(4-sulfamoyl-phenylcarbamoyl)-methyl]-amino}-ethyl)-amino]-ethyl}-[(4-sulfamoyl-phenylcarbamoyl)-methyl]-amino}-acetic acid {{2-[Carboxymethyl-(2-{carboxymethyl-[(4-sulfamoyl-phenylcarbamoyl)-methyl]-amino}-ethyl)-amino]-ethyl}-[(4-sulfamoyl-phenylcarbamoyl)-methyl]-amino}-acetic acid; compound with Zn complex
TypeSmall organic molecule
Emp. Form.C26H35N7O12S2
Mol. Mass.701.726
SMILESNS(=O)(=O)c1ccc(NC(=O)CN(CCN(CCN(CC(O)=O)CC(=O)Nc2ccc(cc2)S(N)(=O)=O)CC(O)=O)CC(O)=O)cc1