Reaction Details
TargetTyrosine-protein phosphatase non-receptor type 1
LigandBDBM50374277
Substrate/Competitorn/a
Meas. Tech.ChEMBL_469204 (CHEMBL932229)
Ki 1500±n/a nM
Citation Seo, CChoi, YHSohn, JHAhn, JSYim, JHLee, HKOh, H Ohioensins F and G: protein tyrosine phosphatase 1B inhibitory benzonaphthoxanthenones from the Antarctic moss Polytrichastrum alpinum. Bioorg Med Chem Lett18:772-5 (2008) 
 
Tyrosine-protein phosphatase non-receptor type 1
Name:Tyrosine-protein phosphatase non-receptor type 1
Type:Protein phosphatase
Mol. Mass.:49963.76
Organism:Homo sapiens (Human)
Description:Human recombinant GST-fusion PTP1B (1-435).
Residue:435
BDBM50374277
NameBDBM50374277
Synonyms:CHEMBL403094
TypeSmall organic molecule
Emp. Form.C23H16O6
Mol. Mass.388.3695
SMILESOc1ccc-2c(c1)[C@@H]1Oc3ccccc3[C@@]3(O)CC(=O)c4c(O)cc(O)c-2c4[C@@H]13