Reaction Details
TargetProthrombin
LigandBDBM14092
Substrate/Competitorn/a
Meas. Tech.ChEMBL_469216 (CHEMBL948917)
Ki 1±n/a nM
Citation Maryanoff, BECostanzo, MJ Inhibitors of proteases and amide hydrolases that employ an alpha-ketoheterocycle as a key enabling functionality. Bioorg Med Chem16:1562-95 (2008) 
 
Prothrombin
Name:Prothrombin
Type:Protein
Mol. Mass.:70029.57
Organism:Homo sapiens (Human)
Description:P00734
Residue:622
BDBM14092
NameBDBM14092
Synonyms:(2S)-N-[(2S)-1-(1,3-benzothiazol-2-yl)-3-(3-carbamimidoylphenyl)-1-oxopropan-2-yl]-1-[(2R)-2-(methylamino)-3-phenylpropanoyl]pyrrolidine-2-carboxamide | 2-ketobenzothiazole 32
TypeSmall organic molecule
Emp. Form.C32H34N6O3S
Mol. Mass.582.716
SMILESCN[C@H](Cc1ccccc1)C(=O)N1CCC[C@H]1C(=O)N[C@@H](Cc1cccc(c1)C(N)=N)C(=O)c1nc2ccccc2s1