Reaction Details
TargetCoagulation factor XII
LigandBDBM50328697
Substrate/Competitorn/a
Meas. Tech.ChEMBL_469231 (CHEMBL948932)
IC50 50±n/a nM
Citation Maryanoff, BECostanzo, MJ Inhibitors of proteases and amide hydrolases that employ an alpha-ketoheterocycle as a key enabling functionality. Bioorg Med Chem16:1562-95 (2008) 
 
Coagulation factor XII
Name:Coagulation factor XII
Type:Enzyme
Mol. Mass.:67810.07
Organism:Homo sapiens (Human)
Description:P00748
Residue:615
BDBM50328697
NameBDBM50328697
Synonyms:(R)-5-guanidino-N-(2-((S)-5-guanidino-1-oxo-1-(thiazol-2-yl)pentan-2-ylamino)-2-oxoethyl)-2-(phenylmethylsulfonamido)pentanamide | CHEMBL414002
TypeSmall organic molecule
Emp. Form.C24H36N10O5S2
Mol. Mass.608.737
SMILES[#7]\[#6](-[#7])=[#7]\[#6]-[#6]-[#6]-[#6@H](-[#7]-[#6](=O)-[#6]-[#7]-[#6](=O)-[#6@@H](-[#6]-[#6]-[#6]\[#7]=[#6](\[#7])-[#7])-[#7]S(=O)(=O)[#6]-c1ccccc1)-[#6](=O)-c1nccs1