Reaction Details
TargetProthrombin
LigandBDBM50374314
Substrate/Competitorn/a
Meas. Tech.ChEMBL_469216 (CHEMBL948917)
Ki 1±n/a nM
Citation Maryanoff, BECostanzo, MJ Inhibitors of proteases and amide hydrolases that employ an alpha-ketoheterocycle as a key enabling functionality. Bioorg Med Chem16:1562-95 (2008) 
 
Prothrombin
Name:Prothrombin
Type:Protein
Mol. Mass.:70029.57
Organism:Homo sapiens (Human)
Description:P00734
Residue:622
BDBM50374314
NameBDBM50374314
Synonyms:CHEMBL438351
TypeSmall organic molecule
Emp. Form.C28H35N9O4S
Mol. Mass.593.7
SMILESN[C@H](Cc1cc2ccccc2[nH]1)C(=O)N1C[C@@H]2CC[C@H](N2C(=O)C1)C(=O)N[C@@H](CCCN=C(N)N)C(=O)c1nccs1