Reaction Details
TargetProthrombin
LigandBDBM50374318
Substrate/Competitorn/a
Meas. Tech.ChEMBL_469216 (CHEMBL948917)
Ki 1.2±n/a nM
Citation Maryanoff, BECostanzo, MJ Inhibitors of proteases and amide hydrolases that employ an alpha-ketoheterocycle as a key enabling functionality. Bioorg Med Chem16:1562-95 (2008) 
 
Prothrombin
Name:Prothrombin
Type:Protein
Mol. Mass.:70029.57
Organism:Homo sapiens (Human)
Description:P00734
Residue:622
BDBM50374318
NameBDBM50374318
Synonyms:CHEMBL402378
TypeSmall organic molecule
Emp. Form.C34H40ClN7O4S
Mol. Mass.678.244
SMILESNC(=N)N1CCC[C@@H](C[C@H](NC(=O)CN2[C@H](Cc3ccccc3Cl)C(=O)N(CCCc3ccccc3)CC2=O)C(=O)c2nccs2)C1