Reaction Details
TargetNeutrophil elastase
LigandBDBM50374351
Substrate/Competitorn/a
Meas. Tech.ChEMBL_469207 (CHEMBL932239)
Ki 0.35±n/a nM
Citation Maryanoff, BECostanzo, MJ Inhibitors of proteases and amide hydrolases that employ an alpha-ketoheterocycle as a key enabling functionality. Bioorg Med Chem16:1562-95 (2008) 
 
Neutrophil elastase
Name:Neutrophil elastase
Type:Enzyme
Mol. Mass.:28532.38
Organism:Homo sapiens (Human)
Description:P08246
Residue:267
BDBM50374351
NameBDBM50374351
Synonyms:CHEMBL404910
TypeSmall organic molecule
Emp. Form.C31H37N5O9S
Mol. Mass.655.719
SMILESCOC(=O)c1ccc2nc(oc2c1)C(=O)[C@@H](NC(=O)[C@@H]1CCCN1C(=O)[C@@H](NC(=O)c1ccc(cc1)S(N)(=O)=O)C(C)C)C(C)C