Reaction Details
TargetNeutrophil elastase
LigandBDBM50095526
Substrate/Competitorn/a
Meas. Tech.ChEMBL_469207 (CHEMBL932239)
Ki 0.49±n/a nM
Citation Maryanoff, BECostanzo, MJ Inhibitors of proteases and amide hydrolases that employ an alpha-ketoheterocycle as a key enabling functionality. Bioorg Med Chem16:1562-95 (2008) 
 
Neutrophil elastase
Name:Neutrophil elastase
Type:Enzyme
Mol. Mass.:28532.38
Organism:Homo sapiens (Human)
Description:P08246
Residue:267
BDBM50095526
NameBDBM50095526
Synonyms:CHEMBL24058 [2-Methyl-1-(2-{2-methyl-1-[5-(3-methyl-benzyl)-[1,2,4]oxadiazole-3-carbonyl]-propylcarbamoyl}-pyrrolidine-1-carbonyl)-propyl]-carbamic acid benzyl ester
TypeSmall organic molecule
Emp. Form.C33H41N5O6
Mol. Mass.603.7085
SMILESCC(C)[C@H](NC(=O)OCc1ccccc1)C(=O)N1CCC[C@H]1C(=O)N[C@@H](C(C)C)C(=O)c1noc(Cc2cccc(C)c2)n1