Reaction Details
TargetProthrombin
LigandBDBM50118731
Substrate/Competitorn/a
Meas. Tech.ChEMBL_469216 (CHEMBL948917)
Ki 0.42±n/a nM
Citation Maryanoff, BECostanzo, MJ Inhibitors of proteases and amide hydrolases that employ an alpha-ketoheterocycle as a key enabling functionality. Bioorg Med Chem16:1562-95 (2008) 
 
Prothrombin
Name:Prothrombin
Type:Protein
Mol. Mass.:70029.57
Organism:Homo sapiens (Human)
Description:P00734
Residue:622
BDBM50118731
NameBDBM50118731
Synonyms:(2-{2-[5-Amino-1-(oxazole-2-carbonyl)-pentylcarbamoyl]-pyrrolidin-1-yl}-1-cyclohexylmethyl-2-oxo-ethylamino)-acetic acid CHEMBL341581
TypeSmall organic molecule
Emp. Form.C25H39N5O6
Mol. Mass.505.6071
SMILESNCCCC[C@H](NC(=O)[C@@H]1CCCN1C(=O)[C@@H](CC1CCCCC1)NCC(O)=O)C(=O)c1ncco1