Reaction Details
TargetGranzyme B
LigandBDBM50374384
Substrate/Competitorn/a
Meas. Tech.ChEMBL_469245 (CHEMBL948945)
Ki 7±n/a nM
Citation Maryanoff, BECostanzo, MJ Inhibitors of proteases and amide hydrolases that employ an alpha-ketoheterocycle as a key enabling functionality. Bioorg Med Chem16:1562-95 (2008) 
 
Granzyme B
Name:Granzyme B
Type:PROTEIN
Mol. Mass.:27735.56
Organism:Homo sapiens (Human)
Description:ChEMBL_469245
Residue:247
BDBM50374384
NameBDBM50374384
Synonyms:CHEMBL255387
TypeSmall organic molecule
Emp. Form.C33H36N6O8
Mol. Mass.644.6743
SMILESCC[C@H](C)[C@H](NC(C)=O)C(=O)N[C@H]1CCc2cccc3C[C@H](N(c23)C1=O)C(=O)N[C@@H](CC(O)=O)C(=O)c1nnc(o1)-c1ccccc1