Reaction Details
TargetOrexin receptor type 2
LigandBDBM50374441
Substrate/Competitorn/a
Meas. Tech.ChEMBL_469337 (CHEMBL932891)
Ki 0.2±n/a nM
Citation Bergman, JMRoecker, AJMercer, SPBednar, RAReiss, DRRansom, RWMeacham Harrell, CPettibone, DJLemaire, WMurphy, KLLi, CPrueksaritanont, TWinrow, CJRenger, JJKoblan, KSHartman, GDColeman, PJ Proline bis-amides as potent dual orexin receptor antagonists. Bioorg Med Chem Lett18:1425-30 (2008) 
 
Orexin receptor type 2
Name:Orexin receptor type 2
Type:Protein
Mol. Mass.:50710.53
Organism:Homo sapiens (Human)
Description:O43614
Residue:444
BDBM50374441
NameBDBM50374441
Synonyms:CHEMBL429848
TypeSmall organic molecule
Emp. Form.C27H26N4O2S
Mol. Mass.470.586
SMILESCn1c(SCC(=O)N2CCC[C@H]2C(=O)Nc2ccccc2-c2ccccc2)nc2ccccc12