Reaction Details
TargetOrexin receptor type 2
LigandBDBM50374444
Substrate/Competitorn/a
Meas. Tech.ChEMBL_469337 (CHEMBL932891)
Ki 0.2±n/a nM
Citation Bergman, JMRoecker, AJMercer, SPBednar, RAReiss, DRRansom, RWMeacham Harrell, CPettibone, DJLemaire, WMurphy, KLLi, CPrueksaritanont, TWinrow, CJRenger, JJKoblan, KSHartman, GDColeman, PJ Proline bis-amides as potent dual orexin receptor antagonists. Bioorg Med Chem Lett18:1425-30 (2008) 
 
Orexin receptor type 2
Name:Orexin receptor type 2
Type:Protein
Mol. Mass.:50710.53
Organism:Homo sapiens (Human)
Description:O43614
Residue:444
BDBM50374444
NameBDBM50374444
Synonyms:CHEMBL401653
TypeSmall organic molecule
Emp. Form.C25H25N5O2S
Mol. Mass.459.563
SMILESCc1ccc2nc(SCC(=O)N3CCC[C@H]3C(=O)Nc3ccccc3-n3cccc3)[nH]c2c1