Reaction Details
TargetOrexin receptor type 2
LigandBDBM50374448
Substrate/Competitorn/a
Meas. Tech.ChEMBL_469337 (CHEMBL932891)
Ki 0.3±n/a nM
Citation Bergman, JMRoecker, AJMercer, SPBednar, RAReiss, DRRansom, RWMeacham Harrell, CPettibone, DJLemaire, WMurphy, KLLi, CPrueksaritanont, TWinrow, CJRenger, JJKoblan, KSHartman, GDColeman, PJ Proline bis-amides as potent dual orexin receptor antagonists. Bioorg Med Chem Lett18:1425-30 (2008) 
 
Orexin receptor type 2
Name:Orexin receptor type 2
Type:Protein
Mol. Mass.:50710.53
Organism:Homo sapiens (Human)
Description:O43614
Residue:444
BDBM50374448
NameBDBM50374448
Synonyms:CHEMBL429130
TypeSmall organic molecule
Emp. Form.C25H25N5O2S
Mol. Mass.459.563
SMILESCn1c(SCC(=O)N2CCC[C@H]2C(=O)Nc2ccccc2-n2cccc2)nc2ccccc12