Reaction Details
TargetOrexin receptor type 2
LigandBDBM50374451
Substrate/Competitorn/a
Meas. Tech.ChEMBL_469337 (CHEMBL932891)
Ki 2±n/a nM
Citation Bergman, JMRoecker, AJMercer, SPBednar, RAReiss, DRRansom, RWMeacham Harrell, CPettibone, DJLemaire, WMurphy, KLLi, CPrueksaritanont, TWinrow, CJRenger, JJKoblan, KSHartman, GDColeman, PJ Proline bis-amides as potent dual orexin receptor antagonists. Bioorg Med Chem Lett18:1425-30 (2008) 
 
Orexin receptor type 2
Name:Orexin receptor type 2
Type:Protein
Mol. Mass.:50710.53
Organism:Homo sapiens (Human)
Description:O43614
Residue:444
BDBM50374451
NameBDBM50374451
Synonyms:CHEMBL255780
TypeSmall organic molecule
Emp. Form.C28H28N4O3
Mol. Mass.468.5469
SMILESCOc1ccccc1-c1ccccc1NC(=O)[C@@H]1CCCN1C(=O)CCc1nc2ccccc2[nH]1