Reaction Details
Target72 kDa type IV collagenase
LigandBDBM50374493
Substrate/Competitorn/a
Meas. Tech.ChEMBL_469430 (CHEMBL946788)
IC50 4.9±n/a nM
Citation Zhang, YMFan, XChakaravarty, DXiang, BScannevin, RHHuang, ZMa, JBurke, SLKarnachi, PRhodes, KJJackson, PF 1-Hydroxy-2-pyridinone-based MMP inhibitors: synthesis and biological evaluation for the treatment of ischemic stroke. Bioorg Med Chem Lett18:409-13 (2008) 
 
72 kDa type IV collagenase
Name:72 kDa type IV collagenase
Type:Enzyme
Mol. Mass.:73870.36
Organism:Homo sapiens (Human)
Description: P08253
Residue:660
BDBM50374493
NameBDBM50374493
Synonyms:CHEMBL429431
TypeSmall organic molecule
Emp. Form.C23H22ClN3O7S
Mol. Mass.519.955
SMILESOn1cccc(N(CC(=O)N2CCOCC2)S(=O)(=O)c2ccc(Oc3ccc(Cl)cc3)cc2)c1=O