Reaction Details
TargetRAC-beta serine/threonine-protein kinase
LigandBDBM15169
Substrate/Competitorn/a
Meas. Tech.ChEMBL_469474 (CHEMBL948033)
IC50 210±n/a nM
Citation Zhao, ZRobinson, RGBarnett, SFDefeo-Jones, DJones, REHartman, GDHuber, HEDuggan, MELindsley, CW Development of potent, allosteric dual Akt1 and Akt2 inhibitors with improved physical properties and cell activity. Bioorg Med Chem Lett18:49-53 (2008) 
 
RAC-beta serine/threonine-protein kinase
Name:RAC-beta serine/threonine-protein kinase
Type:Enzyme
Mol. Mass.:55766.64
Organism:Homo sapiens (Human)
Description:n/a
Residue:481
BDBM15169
NameBDBM15169
Synonyms:1-{1-[(4-{7-phenyl-1H-imidazo[4,5-g]quinoxalin-6-yl}phenyl)methyl]piperidin-4-yl}-2,3-dihydro-1H-1,3-benzodiazol-2-one imidazoquinoxaline | imidazoquinoxaline 16h
TypeSmall organic molecule
Emp. Form.C34H29N7O
Mol. Mass.551.6404
SMILESO=c1[nH]c2ccccc2n1C1CCN(Cc2ccc(cc2)-c2nc3cc4[nH]cnc4cc3nc2-c2ccccc2)CC1