Reaction Details
TargetSigma non-opioid intracellular receptor 1
LigandBDBM50374603
Substrate/Competitorn/a
Meas. Tech.ChEMBL_469590 (CHEMBL934063)
Ki 4.6±n/a nM
Citation Mésangeau, CNarayanan, SGreen, AMShaikh, JKaushal, NViard, EXu, YTFishback, JAPoupaert, JHMatsumoto, RRMcCurdy, CR Conversion of a highly selective sigma-1 receptor-ligand to sigma-2 receptor preferring ligands with anticocaine activity. J Med Chem51:1482-6 (2008) 
 
Sigma non-opioid intracellular receptor 1
Name:Sigma non-opioid intracellular receptor 1
Type:Enzyme Catalytic Domain
Mol. Mass.:25266.54
Organism:RAT
Description:Q9R0C9
Residue:223
BDBM50374603
NameBDBM50374603
Synonyms:CHEMBL272610 US9724435, Compound SN-48
TypeSmall organic molecule
Emp. Form.C23H35N3O2
Mol. Mass.385.5429
SMILESO=c1oc2ccccc2n1CCCCCCN1CCN(CC1)C1CCCCC1