Reaction Details
TargetTyrosine-protein kinase Lck
LigandBDBM50374614
Substrate/Competitorn/a
Meas. Tech.ChEMBL_469608 (CHEMBL934187)
IC50 8±n/a nM
Citation Martin, MWNewcomb, JNunes, JJBoucher, CChai, LEpstein, LFFaust, TFlores, SGallant, PGore, AGu, YHsieh, FHuang, XKim, JLMiddleton, SMorgenstern, KOliveira-dos-Santos, APatel, VFPowers, DRose, PTudor, YTurci, SMWelcher, AAZack, DZhao, HZhu, LZhu, XGhiron, CErmann, MJohnston, DSaluste, CG Structure-based design of novel 2-amino-6-phenyl-pyrimido[5',4':5,6]pyrimido[1,2-a]benzimidazol-5(6H)-ones as potent and orally active inhibitors of lymphocyte specific kinase (Lck): synthesis, SAR, and in vivo anti-inflammatory activity. J Med Chem51:1637-48 (2008) 
 
Tyrosine-protein kinase Lck
Name:Tyrosine-protein kinase Lck
Type:n/a
Mol. Mass.:57987.83
Organism:Homo sapiens (Human)
Description:P06239
Residue:509
BDBM50374614
NameBDBM50374614
Synonyms:CHEMBL254674
TypeSmall organic molecule
Emp. Form.C29H23Cl3N8O
Mol. Mass.605.905
SMILESCN1CCN(CC1)c1ccc(Nc2ncc3c(n2)n2c4ccccc4nc2n(-c2c(Cl)cc(Cl)cc2Cl)c3=O)cc1