Reaction Details
TargetMitogen-activated protein kinase 14
LigandBDBM50374627
Substrate/Competitorn/a
Meas. Tech.ChEMBL_469610 (CHEMBL934189)
IC50 78±n/a nM
Citation Martin, MWNewcomb, JNunes, JJBoucher, CChai, LEpstein, LFFaust, TFlores, SGallant, PGore, AGu, YHsieh, FHuang, XKim, JLMiddleton, SMorgenstern, KOliveira-dos-Santos, APatel, VFPowers, DRose, PTudor, YTurci, SMWelcher, AAZack, DZhao, HZhu, LZhu, XGhiron, CErmann, MJohnston, DSaluste, CG Structure-based design of novel 2-amino-6-phenyl-pyrimido[5',4':5,6]pyrimido[1,2-a]benzimidazol-5(6H)-ones as potent and orally active inhibitors of lymphocyte specific kinase (Lck): synthesis, SAR, and in vivo anti-inflammatory activity. J Med Chem51:1637-48 (2008) 
 
Mitogen-activated protein kinase 14
Name:Mitogen-activated protein kinase 14
Type:Serine/threonine-protein kinase
Mol. Mass.:41286.76
Organism:Homo sapiens (Human)
Description:Q16539
Residue:360
BDBM50374627
NameBDBM50374627
Synonyms:CHEMBL270692
TypeSmall organic molecule
Emp. Form.C27H27N7O3
Mol. Mass.497.5484
SMILESCOc1cc(Nc2ncnc(n2)-n2c(Nc3c(C)cccc3C)nc3ccccc23)cc(OC)c1OC