Reaction Details
TargetTyrosine-protein kinase Lyn
LigandBDBM50374608
Substrate/Competitorn/a
Meas. Tech.ChEMBL_469617 (CHEMBL934196)
IC50 21±n/a nM
Citation Martin, MWNewcomb, JNunes, JJBoucher, CChai, LEpstein, LFFaust, TFlores, SGallant, PGore, AGu, YHsieh, FHuang, XKim, JLMiddleton, SMorgenstern, KOliveira-dos-Santos, APatel, VFPowers, DRose, PTudor, YTurci, SMWelcher, AAZack, DZhao, HZhu, LZhu, XGhiron, CErmann, MJohnston, DSaluste, CG Structure-based design of novel 2-amino-6-phenyl-pyrimido[5',4':5,6]pyrimido[1,2-a]benzimidazol-5(6H)-ones as potent and orally active inhibitors of lymphocyte specific kinase (Lck): synthesis, SAR, and in vivo anti-inflammatory activity. J Med Chem51:1637-48 (2008) 
 
Tyrosine-protein kinase Lyn
Name:Tyrosine-protein kinase Lyn
Type:Protein
Mol. Mass.:58575.92
Organism:Homo sapiens (Human)
Description:P07948
Residue:512
BDBM50374608
NameBDBM50374608
Synonyms:CHEMBL410295
TypeSmall organic molecule
Emp. Form.C31H30N8O
Mol. Mass.530.6229
SMILESCN1CCN(CC1)c1ccc(Nc2ncc3c(n2)n2c(nc4ccccc24)n(-c2c(C)cccc2C)c3=O)cc1