Reaction Details
TargetVascular endothelial growth factor receptor 2
LigandBDBM50374627
Substrate/Competitorn/a
Meas. Tech.ChEMBL_469611 (CHEMBL934190)
IC50 4±n/a nM
Citation Martin, MWNewcomb, JNunes, JJBoucher, CChai, LEpstein, LFFaust, TFlores, SGallant, PGore, AGu, YHsieh, FHuang, XKim, JLMiddleton, SMorgenstern, KOliveira-dos-Santos, APatel, VFPowers, DRose, PTudor, YTurci, SMWelcher, AAZack, DZhao, HZhu, LZhu, XGhiron, CErmann, MJohnston, DSaluste, CG Structure-based design of novel 2-amino-6-phenyl-pyrimido[5',4':5,6]pyrimido[1,2-a]benzimidazol-5(6H)-ones as potent and orally active inhibitors of lymphocyte specific kinase (Lck): synthesis, SAR, and in vivo anti-inflammatory activity. J Med Chem51:1637-48 (2008) 
 
Vascular endothelial growth factor receptor 2
Name:Vascular endothelial growth factor receptor 2
Type:Receptor Tyrosine Kinase
Mol. Mass.:151510.97
Organism:Homo sapiens (Human)
Description:P35968
Residue:1356
BDBM50374627
NameBDBM50374627
Synonyms:CHEMBL270692
TypeSmall organic molecule
Emp. Form.C27H27N7O3
Mol. Mass.497.5484
SMILESCOc1cc(Nc2ncnc(n2)-n2c(Nc3c(C)cccc3C)nc3ccccc23)cc(OC)c1OC