Reaction Details
TargetKappa-type opioid receptor
LigandBDBM50374641
Substrate/Competitorn/a
Meas. Tech.ChEMBL_469676 (CHEMBL946804)
Ki 50±n/a nM
Citation Munro, TADuncan, KKXu, WWang, YLiu-Chen, LYCarlezon, WACohen, BMBéguin, C Standard protecting groups create potent and selective kappa opioids: salvinorin B alkoxymethyl ethers. Bioorg Med Chem16:1279-86 (2008) 
 
Kappa-type opioid receptor
Name:Kappa-type opioid receptor
Type:G Protein-Coupled Receptor (GPCR)
Mol. Mass.:42648.76
Organism:Homo sapiens (Human)
Description:P41145
Residue:380
BDBM50374641
NameBDBM50374641
Synonyms:CHEMBL270844
TypeSmall organic molecule
Emp. Form.C22H27FO7
Mol. Mass.422.444
SMILESCOC(=O)[C@@H]1C[C@H](OCF)C(=O)[C@H]2[C@@]1(C)CC[C@H]1C(=O)O[C@@H](C[C@]21C)c1ccoc1