Reaction Details
TargetKappa-type opioid receptor
LigandBDBM50374644
Substrate/Competitorn/a
Meas. Tech.ChEMBL_469679 (CHEMBL946807)
EC50 108±n/a nM
Citation Munro, TADuncan, KKXu, WWang, YLiu-Chen, LYCarlezon, WACohen, BMBéguin, C Standard protecting groups create potent and selective kappa opioids: salvinorin B alkoxymethyl ethers. Bioorg Med Chem16:1279-86 (2008) 
 
Kappa-type opioid receptor
Name:Kappa-type opioid receptor
Type:G Protein-Coupled Receptor (GPCR)
Mol. Mass.:42648.76
Organism:Homo sapiens (Human)
Description:P41145
Residue:380
BDBM50374644
NameBDBM50374644
Synonyms:CHEMBL271285
TypeSmall organic molecule
Emp. Form.C26H36O8
Mol. Mass.476.5592
SMILESCOC(=O)[C@@H]1C[C@H](OCOC(C)(C)C)C(=O)[C@H]2[C@@]1(C)CC[C@H]1C(=O)O[C@@H](C[C@]21C)c1ccoc1