Reaction Details
TargetDelta-type opioid receptor
LigandBDBM50374629
Substrate/Competitorn/a
Meas. Tech.ChEMBL_469678 (CHEMBL946806)
Ki>1000±n/a nM
Citation Munro, TADuncan, KKXu, WWang, YLiu-Chen, LYCarlezon, WACohen, BMBéguin, C Standard protecting groups create potent and selective kappa opioids: salvinorin B alkoxymethyl ethers. Bioorg Med Chem16:1279-86 (2008) 
 
Delta-type opioid receptor
Name:Delta-type opioid receptor
Type:Enzyme Catalytic Domain
Mol. Mass.:40577.25
Organism:MOUSE
Description:P32300
Residue:372
BDBM50374629
NameBDBM50374629
Synonyms:CHEMBL403137
TypeSmall organic molecule
Emp. Form.C26H34O8
Mol. Mass.474.5434
SMILESCOC(=O)[C@@H]1C[C@H](OC2CCCCO2)C(=O)[C@H]2[C@@]1(C)CC[C@H]1C(=O)O[C@@H](C[C@]21C)c1ccoc1